Reaction Details
TargetBromodomain-containing protein 2
LigandBDBM50365462
Substrate/Competitorn/a
Meas. Tech.ChEMBL_807445 (CHEMBL1958567)
Kd 28000±n/a nM
Citation Sasaki, KIto, AYoshida, M Development of live-cell imaging probes for monitoring histone modifications. Bioorg Med Chem20:1887-92 (2012) 
 
Bromodomain-containing protein 2
Name:Bromodomain-containing protein 2
Type:Protein
Mol. Mass.:88085.95
Organism:Homo sapiens (Human)
Description:P25440
Residue:801
BDBM50365462
NameBDBM50365462
Synonyms:CHEMBL1738777
TypeSmall organic molecule
Emp. Form.C17H16N4S2
Mol. Mass.340.466
SMILESCn1c2ccccc2n(CCSc2nc3ccccc3[nH]2)c1=S