Reaction Details
TargetBromodomain-containing protein 4
LigandBDBM50365264
Substrate/Competitorn/a
Meas. Tech.ChEMBL_807444 (CHEMBL1958566)
Kd 52.5±n/a nM
Citation Sasaki, KIto, AYoshida, M Development of live-cell imaging probes for monitoring histone modifications. Bioorg Med Chem20:1887-92 (2012) 
 
Bromodomain-containing protein 4
Name:Bromodomain-containing protein 4
Type:Protein
Mol. Mass.:152264.84
Organism:Homo sapiens (Human)
Description:O60885
Residue:1362
BDBM50365264
NameBDBM50365264
Synonyms:CHEMBL1738926
TypeSmall organic molecule
Emp. Form.C25H21N5O2
Mol. Mass.423.4665
SMILESCc1nnc2[C@H](NC(=O)OCc3ccccc3)N=C(c3ccccc3)c3ccccc3-n12