Reaction Details
TargetcAMP and cAMP-inhibited cGMP 3',5'-cyclic phosphodiesterase 10A
LigandBDBM50209531
Substrate/Competitorn/a
Meas. Tech.ChEMBL_807649 (CHEMBL1960211)
IC50 8±n/a nM
Citation Bauer, UGiordanetto, FBauer, MO'Mahony, GJohansson, KEKnecht, WHartleib-Geschwindner, JCarlsson, ETEnroth, C Discovery of 4-hydroxy-1,6-naphthyridine-3-carbonitrile derivatives as novel PDE10A inhibitors. Bioorg Med Chem Lett22:1944-8 (2012) 
 
cAMP and cAMP-inhibited cGMP 3',5'-cyclic phosphodiesterase 10A
Name:cAMP and cAMP-inhibited cGMP 3',5'-cyclic phosphodiesterase 10A
Type:Protein
Mol. Mass.:88412.52
Organism:Homo sapiens (Human)
Description:Q9Y233
Residue:779
BDBM50209531
NameBDBM50209531
Synonyms:(R)-2-[3-cyano-2-(2'-ethoxy-biphenyl-4-yl)-6-fluoro-quinolin-4-ylamino]-propionic acid | CHEMBL248380
TypeSmall organic molecule
Emp. Form.C27H22FN3O3
Mol. Mass.455.4803
SMILESCCOc1ccccc1-c1ccc(cc1)-c1nc2ccc(F)cc2c(N[C@H](C)C(O)=O)c1C#N