Reaction Details
TargetcAMP and cAMP-inhibited cGMP 3',5'-cyclic phosphodiesterase 10A
LigandBDBM50365479
Substrate/Competitorn/a
Meas. Tech.ChEMBL_807649 (CHEMBL1960211)
IC50 13±n/a nM
Citation Bauer, UGiordanetto, FBauer, MO'Mahony, GJohansson, KEKnecht, WHartleib-Geschwindner, JCarlsson, ETEnroth, C Discovery of 4-hydroxy-1,6-naphthyridine-3-carbonitrile derivatives as novel PDE10A inhibitors. Bioorg Med Chem Lett22:1944-8 (2012) 
 
cAMP and cAMP-inhibited cGMP 3',5'-cyclic phosphodiesterase 10A
Name:cAMP and cAMP-inhibited cGMP 3',5'-cyclic phosphodiesterase 10A
Type:Protein
Mol. Mass.:88412.52
Organism:Homo sapiens (Human)
Description:Q9Y233
Residue:779
BDBM50365479
NameBDBM50365479
Synonyms:CHEMBL1957364
TypeSmall organic molecule
Emp. Form.C22H15N3O2
Mol. Mass.353.3734
SMILESCOc1ccccc1-c1ccc(cc1)-c1nc2ccncc2c(O)c1C#N