Reaction Details
TargetcAMP and cAMP-inhibited cGMP 3',5'-cyclic phosphodiesterase 10A
LigandBDBM50365480
Substrate/Competitorn/a
Meas. Tech.ChEMBL_807649 (CHEMBL1960211)
IC50 1±n/a nM
Citation Bauer, UGiordanetto, FBauer, MO'Mahony, GJohansson, KEKnecht, WHartleib-Geschwindner, JCarlsson, ETEnroth, C Discovery of 4-hydroxy-1,6-naphthyridine-3-carbonitrile derivatives as novel PDE10A inhibitors. Bioorg Med Chem Lett22:1944-8 (2012) 
 
cAMP and cAMP-inhibited cGMP 3',5'-cyclic phosphodiesterase 10A
Name:cAMP and cAMP-inhibited cGMP 3',5'-cyclic phosphodiesterase 10A
Type:Protein
Mol. Mass.:88412.52
Organism:Homo sapiens (Human)
Description:Q9Y233
Residue:779
BDBM50365480
NameBDBM50365480
Synonyms:CHEMBL1957366
TypeSmall organic molecule
Emp. Form.C22H12F3N3O2
Mol. Mass.407.3448
SMILESOc1c(C#N)c(nc2ccncc12)-c1ccc(cc1)-c1ccccc1OC(F)(F)F