Reaction Details
TargetRenin
LigandBDBM50365572
Substrate/Competitorn/a
Meas. Tech.ChEMBL_808017 (CHEMBL1961076)
IC50 0.44±n/a nM
Citation Lacombe, PArbour, MAspiotis, RCauchon, EChen, ADubé, DFalgueyret, JPFournier, PAGallant, MGrimm, EHan, YJuteau, HLiu, SMellon, CRamtohul, YSimard, DSt-Jacques, RTsui, GC 3,4-Diarylpiperidines as potent renin inhibitors. Bioorg Med Chem Lett22:1953-7 (2012) 
 
Renin
Name:Renin
Type:Enzyme
Mol. Mass.:45058.99
Organism:Homo sapiens (Human)
Description:n/a
Residue:406
BDBM50365572
NameBDBM50365572
Synonyms:CHEMBL1957797
TypeSmall organic molecule
Emp. Form.C34H44N2O4
Mol. Mass.544.7242
SMILESCOC[C@H](C)COCc1ccc(cc1)[C@@]1(O)CCNC[C@@H]1c1ccc(cc1C)-c1ccccc1CCNC(C)=O