Reaction Details
Target5-hydroxytryptamine receptor 2C
LigandBDBM50365590
Substrate/Competitorn/a
Meas. Tech.ChEMBL_808062 (CHEMBL1961170)
Ki 391±n/a nM
Citation Xiong, YUllman, BChoi, JSCherrier, MStrah-Pleynet, SDecaire, MFeichtinger, KFrazer, JMYoon, WHWhelan, KSanabria, EKGrottick, AJAl-Shamma, HSemple, G Identification of fused bicyclic heterocycles as potent and selective 5-HT(2A) receptor antagonists for the treatment of insomnia. Bioorg Med Chem Lett22:1870-3 (2012) 
 
5-hydroxytryptamine receptor 2C
Name:5-hydroxytryptamine receptor 2C
Type:G Protein-Coupled Receptor (GPCR)
Mol. Mass.:51836.79
Organism:Homo sapiens (Human)
Description:P28335
Residue:458
BDBM50365590
NameBDBM50365590
Synonyms:CHEMBL1957818
TypeSmall organic molecule
Emp. Form.C20H19ClF2N4O
Mol. Mass.404.841
SMILESFc1ccc(CCN2CCN(CC2)C(=O)c2cccn3cc(Cl)nc23)c(F)c1