Reaction Details
Target5-hydroxytryptamine receptor 2C
LigandBDBM50365592
Substrate/Competitorn/a
Meas. Tech.ChEMBL_808062 (CHEMBL1961170)
Ki 194±n/a nM
Citation Xiong, YUllman, BChoi, JSCherrier, MStrah-Pleynet, SDecaire, MFeichtinger, KFrazer, JMYoon, WHWhelan, KSanabria, EKGrottick, AJAl-Shamma, HSemple, G Identification of fused bicyclic heterocycles as potent and selective 5-HT(2A) receptor antagonists for the treatment of insomnia. Bioorg Med Chem Lett22:1870-3 (2012) 
 
5-hydroxytryptamine receptor 2C
Name:5-hydroxytryptamine receptor 2C
Type:G Protein-Coupled Receptor (GPCR)
Mol. Mass.:51836.79
Organism:Homo sapiens (Human)
Description:P28335
Residue:458
BDBM50365592
NameBDBM50365592
Synonyms:CHEMBL1957805
TypeSmall organic molecule
Emp. Form.C20H20F2N4O
Mol. Mass.370.3958
SMILESFc1ccc(CCN2CCN(CC2)C(=O)c2cccc3ccnn23)c(F)c1