Reaction Details
Target5-hydroxytryptamine receptor 2A
LigandBDBM50365584
Substrate/Competitorn/a
Meas. Tech.ChEMBL_808063 (CHEMBL1961171)
Ki 5.9±n/a nM
Citation Xiong, YUllman, BChoi, JSCherrier, MStrah-Pleynet, SDecaire, MFeichtinger, KFrazer, JMYoon, WHWhelan, KSanabria, EKGrottick, AJAl-Shamma, HSemple, G Identification of fused bicyclic heterocycles as potent and selective 5-HT(2A) receptor antagonists for the treatment of insomnia. Bioorg Med Chem Lett22:1870-3 (2012) 
 
5-hydroxytryptamine receptor 2A
Name:5-hydroxytryptamine receptor 2A
Type:undefined
Mol. Mass.:52607.65
Organism:Homo sapiens (Human)
Description:P28223
Residue:471
BDBM50365584
NameBDBM50365584
Synonyms:CHEMBL1957804
TypeSmall organic molecule
Emp. Form.C20H19ClF2N4O
Mol. Mass.404.841
SMILESFc1ccc(CCN2CCN(CC2)C(=O)c2cnn3cc(Cl)ccc23)c(F)c1