Reaction Details
Target5-hydroxytryptamine receptor 2A
LigandBDBM50365591
Substrate/Competitorn/a
Meas. Tech.ChEMBL_808063 (CHEMBL1961171)
Ki 1.8±n/a nM
Citation Xiong, YUllman, BChoi, JSCherrier, MStrah-Pleynet, SDecaire, MFeichtinger, KFrazer, JMYoon, WHWhelan, KSanabria, EKGrottick, AJAl-Shamma, HSemple, G Identification of fused bicyclic heterocycles as potent and selective 5-HT(2A) receptor antagonists for the treatment of insomnia. Bioorg Med Chem Lett22:1870-3 (2012) 
 
5-hydroxytryptamine receptor 2A
Name:5-hydroxytryptamine receptor 2A
Type:undefined
Mol. Mass.:52607.65
Organism:Homo sapiens (Human)
Description:P28223
Residue:471
BDBM50365591
NameBDBM50365591
Synonyms:CHEMBL1957803
TypeSmall organic molecule
Emp. Form.C20H20F2N4O
Mol. Mass.370.3958
SMILESFc1ccc(CCN2CCN(CC2)C(=O)c2cnn3ccccc23)c(F)c1