Reaction Details
TargetPolyunsaturated fatty acid 5-lipoxygenase
LigandBDBM22334
Substrate/Competitorn/a
Meas. Tech.ChEMBL_808211 (CHEMBL1961123)
IC50 50±n/a nM
Citation Hieke, MRödl, CBWisniewska, JMla Buscató, EStark, HSchubert-Zsilavecz, MSteinhilber, DHofmann, BProschak, E SAR-study on a new class of imidazo[1,2-a]pyridine-based inhibitors of 5-lipoxygenase. Bioorg Med Chem Lett22:1969-75 (2012) 
 
Polyunsaturated fatty acid 5-lipoxygenase
Name:Polyunsaturated fatty acid 5-lipoxygenase
Type:Enzyme
Mol. Mass.:77972.74
Organism:Homo sapiens (Human)
Description:Recombinant protein was purified from E. coli lysate. After ammonium sulfate precipitation and subsequent steps, the supernatant (S100) was used for 5-LO activity assay.
Residue:674
BDBM22334
NameBDBM22334
Synonyms:BW A4C BWA4C CHEMBL314360 N-(3-phenoxycinnamyl)acetohydroxamic acid | N-hydroxy-N-[(2E)-3-(3-phenoxyphenyl)prop-2-en-1-yl]acetamide
TypeSmall organic molecule
Emp. Form.C17H17NO3
Mol. Mass.283.3218
SMILESCC(=O)N(O)C\C=C\c1cccc(Oc2ccccc2)c1