Reaction Details
TargetMAP kinase-activated protein kinase 5
LigandBDBM50365784
Substrate/Competitorn/a
Meas. Tech.ChEMBL_806119 (CHEMBL1960722)
IC50 1490±n/a nM
Citation Andrews, MJClase, JABar, GTricarico, GEdwards, PJBrys, RChambers, MSchmidt, WMacLeod, AHirst, KAllen, VBirault, VLe, JHarris, JSelf, ANash, KDixon, G Discovery of a series of imidazopyrazine small molecule inhibitors of the kinase MAPKAPK5, that show activity using in vitro and in vivo models of rheumatoid arthritis. Bioorg Med Chem Lett22:2266-70 (2012) 
 
MAP kinase-activated protein kinase 5
Name:MAP kinase-activated protein kinase 5
Type:Serine/threonine-protein kinase
Mol. Mass.:54229.92
Organism:Homo sapiens (Human)
Description:Recombinant MAPKAPK5 was phosphorylated by incubation with active p38alpha before assays.
Residue:473
BDBM50365784
NameBDBM50365784
Synonyms:CHEMBL1956563
TypeSmall organic molecule
Emp. Form.C18H18N8O
Mol. Mass.362.3885
SMILESC1CN(CCO1)c1ccc(Nc2ncc(-c3c[nH]nn3)n3ccnc23)cc1