Reaction Details
TargetMAP kinase-activated protein kinase 5
LigandBDBM50365799
Substrate/Competitorn/a
Meas. Tech.ChEMBL_806119 (CHEMBL1960722)
IC50 290±n/a nM
Citation Andrews, MJClase, JABar, GTricarico, GEdwards, PJBrys, RChambers, MSchmidt, WMacLeod, AHirst, KAllen, VBirault, VLe, JHarris, JSelf, ANash, KDixon, G Discovery of a series of imidazopyrazine small molecule inhibitors of the kinase MAPKAPK5, that show activity using in vitro and in vivo models of rheumatoid arthritis. Bioorg Med Chem Lett22:2266-70 (2012) 
 
MAP kinase-activated protein kinase 5
Name:MAP kinase-activated protein kinase 5
Type:Serine/threonine-protein kinase
Mol. Mass.:54229.92
Organism:Homo sapiens (Human)
Description:Recombinant MAPKAPK5 was phosphorylated by incubation with active p38alpha before assays.
Residue:473
BDBM50365799
NameBDBM50365799
Synonyms:CHEMBL1956686
TypeSmall organic molecule
Emp. Form.C22H23N7O
Mol. Mass.401.4643
SMILESCN1CCN(CC1)c1ccc(Nc2ncc(-c3cc[nH]c(=O)c3)n3ccnc23)cc1