Reaction Details
TargetGrowth hormone secretagogue receptor type 1
LigandBDBM50365809
Substrate/Competitorn/a
Meas. Tech.ChEMBL_806242 (CHEMBL1958783)
Ki 0.160000±n/a nM
Citation Hanrahan, PBell, JBottomley, GBradley, SClarke, PCurtis, EDavis, SDawson, GHorswill, JKeily, JMoore, GRasamison, CBloxham, J Substituted azaquinazolinones as modulators of GHSr-1a for the treatment of type II diabetes and obesity. Bioorg Med Chem Lett22:2271-8 (2012) 
 
Growth hormone secretagogue receptor type 1
Name:Growth hormone secretagogue receptor type 1
Type:Receptor
Mol. Mass.:41334.57
Organism:Homo sapiens (Human)
Description:Receptor binding studies use plasma membranes from LLC PK-1 cells transiently transfected with hGHSR1a.
Residue:366
BDBM50365809
NameBDBM50365809
Synonyms:CHEMBL1956990
TypeSmall organic molecule
Emp. Form.C23H26BrFN4O2
Mol. Mass.489.381
SMILESCC(C)N1CCC[C@H](Cn2c(C)nc3ncc(Oc4ccc(Br)cc4F)cc3c2=O)C1