Reaction Details
TargetMu-type opioid receptor
LigandBDBM50365855
Substrate/Competitorn/a
Meas. Tech.ChEMBL_806704 (CHEMBL1958664)
Ki 0.08±n/a nM
Citation Lunn, GRoberts, LRContent, SCritcher, DJDouglas, SFenwick, AEGethin, DMGoodwin, GGreenway, DGreenwood, SHall, KThomas, MThompson, SWilliams, DWood, GWylie, A SAR and biological evaluation of 3-azabicyclo[3.1.0]hexane derivatives asµ opioid ligands. Bioorg Med Chem Lett22:2200-3 (2012) 
 
Mu-type opioid receptor
Name:Mu-type opioid receptor
Type:G Protein-Coupled Receptor (GPCR)
Mol. Mass.:44789.51
Organism:Homo sapiens (Human)
Description:P35372
Residue:400
BDBM50365855
NameBDBM50365855
Synonyms:CHEMBL1957843
TypeSmall organic molecule
Emp. Form.C24H30N2O3S
Mol. Mass.426.572
SMILESCC[C@]1([C@H]2CN(CC3Cc4ccccc4C3O)C[C@@H]12)c1cccc(NS(C)(=O)=O)c1