Reaction Details
TargetPhosphatidylinositol 4,5-bisphosphate 3-kinase catalytic subunit beta isoform
LigandBDBM50365867
Substrate/Competitorn/a
Meas. Tech.ChEMBL_806712 (CHEMBL1958672)
IC50 2±n/a nM
Citation Lin, HErhard, KHardwicke, MALuengo, JIMack, JFMcSurdy-Freed, JPlant, RRaha, KRominger, CMSanchez, RMSchaber, MDSchulz, MJSpengler, MDTedesco, RXie, RZeng, JJRivero, RA Synthesis and structure-activity relationships of imidazo[1,2-a]pyrimidin-5(1H)-ones as a novel series of beta isoform selective phosphatidylinositol 3-kinase inhibitors. Bioorg Med Chem Lett22:2230-4 (2012) 
 
Phosphatidylinositol 4,5-bisphosphate 3-kinase catalytic subunit beta isoform
Name:Phosphatidylinositol 4,5-bisphosphate 3-kinase catalytic subunit beta isoform
Type:Enzyme Subunit
Mol. Mass.:122769.00
Organism:Homo sapiens (Human)
Description:P42338
Residue:1070
BDBM50365867
NameBDBM50365867
Synonyms:CHEMBL1957856
TypeSmall organic molecule
Emp. Form.C18H18Cl2N4O2
Mol. Mass.393.267
SMILESCc1cn2c(nc(cc2=O)N2CCOCC2)n1Cc1cccc(Cl)c1Cl