Reaction Details
TargetSodium channel protein type 9 subunit alpha
LigandBDBM50365939
Substrate/Competitorn/a
Meas. Tech.ChEMBL_806942 (CHEMBL1959243)
IC50 1880±n/a nM
Citation Davis, GCKong, YPaige, MLi, ZMerrick, ECHansen, TSuy, SWang, KDakshanamurthy, SCordova, AMcManus, OBWilliams, BSChruszcz, MMinor, WPatel, MKBrown, ML Asymmetric synthesis and evaluation of a hydroxyphenylamide voltage-gated sodium channel blocker in human prostate cancer xenografts. Bioorg Med Chem20:2180-8 (2012) 
 
Sodium channel protein type 9 subunit alpha
Name:Sodium channel protein type 9 subunit alpha
Type:Protein
Mol. Mass.:226375.97
Organism:Homo sapiens (Human)
Description:Q15858
Residue:1988
BDBM50365939
NameBDBM50365939
Synonyms:CHEMBL1958461
TypeSmall organic molecule
Emp. Form.C15H22ClNO2
Mol. Mass.283.794
SMILESCCCCCCC[C@](O)(C(N)=O)c1cccc(Cl)c1