Reaction Details
TargetVasoactive intestinal polypeptide receptor 1
LigandBDBM50241256
Substrate/Competitorn/a
Meas. Tech.ChEMBL_807309 (CHEMBL1960402)
IC50 15000±n/a nM
Citation Harikrishnan, LSSrivastava, NKayser, LENirschl, DSKumaragurubaran, KRoy, AGupta, AKarmakar, SKaratt, TMathur, ABurford, NTChen, JKong, YCvijic, MCooper, CBPoss, MATrainor, GLWong, TW Identification and optimization of small molecule antagonists of vasoactive intestinal peptide receptor-1 (VIPR1). Bioorg Med Chem Lett22:2287-90 (2012) 
 
Vasoactive intestinal polypeptide receptor 1
Name:Vasoactive intestinal polypeptide receptor 1
Type:PROTEIN
Mol. Mass.:52068.73
Organism:Rattus norvegicus
Description:ChEMBL_807309
Residue:459
BDBM50241256
NameBDBM50241256
Synonyms:CHEMBL233000 | N-(3-cyano-4,5,6,7-tetrahydrobenzo[b]thiophen-2-yl)benzamide
TypeSmall organic molecule
Emp. Form.C16H14N2OS
Mol. Mass.282.36
SMILESO=C(Nc1sc2CCCCc2c1C#N)c1ccccc1