Reaction Details
TargetVasoactive intestinal polypeptide receptor 1
LigandBDBM50366012
Substrate/Competitorn/a
Meas. Tech.ChEMBL_807309 (CHEMBL1960402)
IC50 3200±n/a nM
Citation Harikrishnan, LSSrivastava, NKayser, LENirschl, DSKumaragurubaran, KRoy, AGupta, AKarmakar, SKaratt, TMathur, ABurford, NTChen, JKong, YCvijic, MCooper, CBPoss, MATrainor, GLWong, TW Identification and optimization of small molecule antagonists of vasoactive intestinal peptide receptor-1 (VIPR1). Bioorg Med Chem Lett22:2287-90 (2012) 
 
Vasoactive intestinal polypeptide receptor 1
Name:Vasoactive intestinal polypeptide receptor 1
Type:PROTEIN
Mol. Mass.:52068.73
Organism:Rattus norvegicus
Description:ChEMBL_807309
Residue:459
BDBM50366012
NameBDBM50366012
Synonyms:CHEMBL1956259
TypeSmall organic molecule
Emp. Form.C26H30O
Mol. Mass.358.5158
SMILESCC(C)c1cc(cc(c1CO)-c1ccccc1-c1ccccc1)C(C)(C)C