Reaction Details
TargetVasoactive intestinal polypeptide receptor 1
LigandBDBM50366023
Substrate/Competitorn/a
Meas. Tech.ChEMBL_807309 (CHEMBL1960402)
IC50 200±n/a nM
Citation Harikrishnan, LSSrivastava, NKayser, LENirschl, DSKumaragurubaran, KRoy, AGupta, AKarmakar, SKaratt, TMathur, ABurford, NTChen, JKong, YCvijic, MCooper, CBPoss, MATrainor, GLWong, TW Identification and optimization of small molecule antagonists of vasoactive intestinal peptide receptor-1 (VIPR1). Bioorg Med Chem Lett22:2287-90 (2012) 
 
Vasoactive intestinal polypeptide receptor 1
Name:Vasoactive intestinal polypeptide receptor 1
Type:PROTEIN
Mol. Mass.:52068.73
Organism:Rattus norvegicus
Description:ChEMBL_807309
Residue:459
BDBM50366023
NameBDBM50366023
Synonyms:CHEMBL1956412
TypeSmall organic molecule
Emp. Form.C21H28O2
Mol. Mass.312.4458
SMILESCOc1cccc(c1)-c1cc(cc(C(C)C)c1CO)C(C)(C)C