Reaction Details
TargetCarbonic anhydrase 9
LigandBDBM50366032
Substrate/Competitorn/a
Meas. Tech.ChEMBL_807331 (CHEMBL1960511)
Ki>200000±n/a nM
Citation Carta, FVullo, DMaresca, AScozzafava, ASupuran, CT New chemotypes acting as isozyme-selective carbonic anhydrase inhibitors with low affinity for the offtarget cytosolic isoform II. Bioorg Med Chem Lett22:2182-5 (2012) 
 
Carbonic anhydrase 9
Name:Carbonic anhydrase 9
Type:Enzyme
Mol. Mass.:49669.03
Organism:Homo sapiens (Human)
Description:Catalytic domain of human cloned isozyme was used in the assay
Residue:459
BDBM50366032
NameBDBM50366032
Synonyms:THIOMEROSAL
TypeSmall organic molecule
Emp. Form.C9H10HgO2S
Mol. Mass.382.83
SMILESCC[Hg]Sc1ccccc1C(O)=O