Reaction Details
TargetCarbonic anhydrase 7
LigandBDBM50366032
Substrate/Competitorn/a
Meas. Tech.ChEMBL_807332 (CHEMBL1960512)
Ki 10900±n/a nM
Citation Carta, FVullo, DMaresca, AScozzafava, ASupuran, CT New chemotypes acting as isozyme-selective carbonic anhydrase inhibitors with low affinity for the offtarget cytosolic isoform II. Bioorg Med Chem Lett22:2182-5 (2012) 
 
Carbonic anhydrase 7
Name:Carbonic anhydrase 7
Type:Enzyme
Mol. Mass.:29664.11
Organism:Homo sapiens (Human)
Description:Human cloned isozyme.
Residue:264
BDBM50366032
NameBDBM50366032
Synonyms:THIOMEROSAL
TypeSmall organic molecule
Emp. Form.C9H10HgO2S
Mol. Mass.382.83
SMILESCC[Hg]Sc1ccccc1C(O)=O