Reaction Details
TargetCarbonic anhydrase 5A, mitochondrial
LigandBDBM50366032
Substrate/Competitorn/a
Meas. Tech.ChEMBL_807335 (CHEMBL1960515)
Ki 7250±n/a nM
Citation Carta, FVullo, DMaresca, AScozzafava, ASupuran, CT New chemotypes acting as isozyme-selective carbonic anhydrase inhibitors with low affinity for the offtarget cytosolic isoform II. Bioorg Med Chem Lett22:2182-5 (2012) 
 
Carbonic anhydrase 5A, mitochondrial
Name:Carbonic anhydrase 5A, mitochondrial
Type:Enzyme
Mol. Mass.:34755.54
Organism:Homo sapiens (Human)
Description:Human (cloned) isozyme
Residue:305
BDBM50366032
NameBDBM50366032
Synonyms:THIOMEROSAL
TypeSmall organic molecule
Emp. Form.C9H10HgO2S
Mol. Mass.382.83
SMILESCC[Hg]Sc1ccccc1C(O)=O