Reaction Details
TargetCarbonic anhydrase 4
LigandBDBM50366032
Substrate/Competitorn/a
Meas. Tech.ChEMBL_807336 (CHEMBL1960516)
Ki 5610±n/a nM
Citation Carta, FVullo, DMaresca, AScozzafava, ASupuran, CT New chemotypes acting as isozyme-selective carbonic anhydrase inhibitors with low affinity for the offtarget cytosolic isoform II. Bioorg Med Chem Lett22:2182-5 (2012) 
 
Carbonic anhydrase 4
Name:Carbonic anhydrase 4
Type:Enzyme
Mol. Mass.:35037.98
Organism:Homo sapiens (Human)
Description:P22748
Residue:312
BDBM50366032
NameBDBM50366032
Synonyms:THIOMEROSAL
TypeSmall organic molecule
Emp. Form.C9H10HgO2S
Mol. Mass.382.83
SMILESCC[Hg]Sc1ccccc1C(O)=O