Reaction Details
TargetCarbonic anhydrase 6
LigandBDBM50366032
Substrate/Competitorn/a
Meas. Tech.ChEMBL_807321 (CHEMBL1960501)
Ki 5120±n/a nM
Citation Carta, FVullo, DMaresca, AScozzafava, ASupuran, CT New chemotypes acting as isozyme-selective carbonic anhydrase inhibitors with low affinity for the offtarget cytosolic isoform II. Bioorg Med Chem Lett22:2182-5 (2012) 
 
Carbonic anhydrase 6
Name:Carbonic anhydrase 6
Type:Enzyme
Mol. Mass.:35371.40
Organism:Homo sapiens (Human)
Description:P23280
Residue:308
BDBM50366032
NameBDBM50366032
Synonyms:THIOMEROSAL
TypeSmall organic molecule
Emp. Form.C9H10HgO2S
Mol. Mass.382.83
SMILESCC[Hg]Sc1ccccc1C(O)=O