Reaction Details
TargetCarbonic anhydrase 6
LigandBDBM12342
Substrate/Competitorn/a
Meas. Tech.ChEMBL_807333 (CHEMBL1960513)
Ki>200000±n/a nM
Citation Carta, FVullo, DMaresca, AScozzafava, ASupuran, CT New chemotypes acting as isozyme-selective carbonic anhydrase inhibitors with low affinity for the offtarget cytosolic isoform II. Bioorg Med Chem Lett22:2182-5 (2012) 
 
Carbonic anhydrase 6
Name:Carbonic anhydrase 6
Type:Enzyme
Mol. Mass.:35371.40
Organism:Homo sapiens (Human)
Description:P23280
Residue:308
BDBM12342
NameBDBM12342
Synonyms:2H-chromen-2-one Coumarin
TypeNatural product
Emp. Form.C9H6O2
Mol. Mass.146.1427
SMILESO=c1ccc2ccccc2o1