Reaction Details
TargetCarbonic anhydrase 9
LigandBDBM50366033
Substrate/Competitorn/a
Meas. Tech.ChEMBL_807331 (CHEMBL1960511)
Ki 6410±n/a nM
Citation Carta, FVullo, DMaresca, AScozzafava, ASupuran, CT New chemotypes acting as isozyme-selective carbonic anhydrase inhibitors with low affinity for the offtarget cytosolic isoform II. Bioorg Med Chem Lett22:2182-5 (2012) 
 
Carbonic anhydrase 9
Name:Carbonic anhydrase 9
Type:Enzyme
Mol. Mass.:49669.03
Organism:Homo sapiens (Human)
Description:Catalytic domain of human cloned isozyme was used in the assay
Residue:459
BDBM50366033
NameBDBM50366033
Synonyms:ASUNTOL
TypeSmall organic molecule
Emp. Form.C14H16ClO5PS
Mol. Mass.362.766
SMILESCCOP(=S)(OCC)Oc1ccc2c(C)c(Cl)c(=O)oc2c1