Reaction Details
TargetCarbonic anhydrase 7
LigandBDBM50366033
Substrate/Competitorn/a
Meas. Tech.ChEMBL_807332 (CHEMBL1960512)
Ki 4680±n/a nM
Citation Carta, FVullo, DMaresca, AScozzafava, ASupuran, CT New chemotypes acting as isozyme-selective carbonic anhydrase inhibitors with low affinity for the offtarget cytosolic isoform II. Bioorg Med Chem Lett22:2182-5 (2012) 
 
Carbonic anhydrase 7
Name:Carbonic anhydrase 7
Type:Enzyme
Mol. Mass.:29664.11
Organism:Homo sapiens (Human)
Description:Human cloned isozyme.
Residue:264
BDBM50366033
NameBDBM50366033
Synonyms:ASUNTOL
TypeSmall organic molecule
Emp. Form.C14H16ClO5PS
Mol. Mass.362.766
SMILESCCOP(=S)(OCC)Oc1ccc2c(C)c(Cl)c(=O)oc2c1