Reaction Details
TargetCarbonic anhydrase 5A, mitochondrial
LigandBDBM50366034
Substrate/Competitorn/a
Meas. Tech.ChEMBL_807323 (CHEMBL1960503)
Ki 410±n/a nM
Citation Carta, FVullo, DMaresca, AScozzafava, ASupuran, CT New chemotypes acting as isozyme-selective carbonic anhydrase inhibitors with low affinity for the offtarget cytosolic isoform II. Bioorg Med Chem Lett22:2182-5 (2012) 
 
Carbonic anhydrase 5A, mitochondrial
Name:Carbonic anhydrase 5A, mitochondrial
Type:Enzyme
Mol. Mass.:34755.54
Organism:Homo sapiens (Human)
Description:Human (cloned) isozyme
Residue:305
BDBM50366034
NameBDBM50366034
Synonyms:CHEMBL186422
TypeSmall organic molecule
Emp. Form.C9H7NO
Mol. Mass.145.158
SMILESO=c1ccc2ccccc2[nH]1