Reaction Details
TargetCarbonic anhydrase 5B, mitochondrial
LigandBDBM50366035
Substrate/Competitorn/a
Meas. Tech.ChEMBL_807334 (CHEMBL1960514)
Ki 58±n/a nM
Citation Carta, FVullo, DMaresca, AScozzafava, ASupuran, CT New chemotypes acting as isozyme-selective carbonic anhydrase inhibitors with low affinity for the offtarget cytosolic isoform II. Bioorg Med Chem Lett22:2182-5 (2012) 
 
Carbonic anhydrase 5B, mitochondrial
Name:Carbonic anhydrase 5B, mitochondrial
Type:Enzyme
Mol. Mass.:36440.83
Organism:Homo sapiens (Human)
Description:Human (cloned) isozyme
Residue:317
BDBM50366035
NameBDBM50366035
Synonyms:CHEMBL1956579
TypeSmall organic molecule
Emp. Form.C9H7NO2
Mol. Mass.161.1574
SMILESO\N=c1\ccc2ccccc2o1