Reaction Details
TargetCarbonic anhydrase 13
LigandBDBM50366036
Substrate/Competitorn/a
Meas. Tech.ChEMBL_807329 (CHEMBL1960509)
Ki 59±n/a nM
Citation Carta, FVullo, DMaresca, AScozzafava, ASupuran, CT New chemotypes acting as isozyme-selective carbonic anhydrase inhibitors with low affinity for the offtarget cytosolic isoform II. Bioorg Med Chem Lett22:2182-5 (2012) 
 
Carbonic anhydrase 13
Name:Carbonic anhydrase 13
Type:Enzyme
Mol. Mass.:29445.78
Organism:Homo sapiens (Human)
Description:Q8N1Q1
Residue:262
BDBM50366036
NameBDBM50366036
Synonyms:CHEMBL1956578
TypeSmall organic molecule
Emp. Form.C7H9NO2
Mol. Mass.139.1519
SMILESCc1cc(C)o\c(c1)=N\O