Reaction Details
TargetCarbonic anhydrase 14
LigandBDBM50366036
Substrate/Competitorn/a
Meas. Tech.ChEMBL_807328 (CHEMBL1960508)
Ki 48±n/a nM
Citation Carta, FVullo, DMaresca, AScozzafava, ASupuran, CT New chemotypes acting as isozyme-selective carbonic anhydrase inhibitors with low affinity for the offtarget cytosolic isoform II. Bioorg Med Chem Lett22:2182-5 (2012) 
 
Carbonic anhydrase 14
Name:Carbonic anhydrase 14
Type:Enzyme
Mol. Mass.:37665.67
Organism:Homo sapiens (Human)
Description:Human (cloned) isozyme.
Residue:337
BDBM50366036
NameBDBM50366036
Synonyms:CHEMBL1956578
TypeSmall organic molecule
Emp. Form.C7H9NO2
Mol. Mass.139.1519
SMILESCc1cc(C)o\c(c1)=N\O