Reaction Details
TargetCarbonic anhydrase 9
LigandBDBM50366036
Substrate/Competitorn/a
Meas. Tech.ChEMBL_807331 (CHEMBL1960511)
Ki 16±n/a nM
Citation Carta, FVullo, DMaresca, AScozzafava, ASupuran, CT New chemotypes acting as isozyme-selective carbonic anhydrase inhibitors with low affinity for the offtarget cytosolic isoform II. Bioorg Med Chem Lett22:2182-5 (2012) 
 
Carbonic anhydrase 9
Name:Carbonic anhydrase 9
Type:Enzyme
Mol. Mass.:49669.03
Organism:Homo sapiens (Human)
Description:Catalytic domain of human cloned isozyme was used in the assay
Residue:459
BDBM50366036
NameBDBM50366036
Synonyms:CHEMBL1956578
TypeSmall organic molecule
Emp. Form.C7H9NO2
Mol. Mass.139.1519
SMILESCc1cc(C)o\c(c1)=N\O