Reaction Details
TargetCarbonic anhydrase 1
LigandBDBM50366037
Substrate/Competitorn/a
Meas. Tech.ChEMBL_807339 (CHEMBL1960519)
Ki 10800±n/a nM
Citation Carta, FVullo, DMaresca, AScozzafava, ASupuran, CT New chemotypes acting as isozyme-selective carbonic anhydrase inhibitors with low affinity for the offtarget cytosolic isoform II. Bioorg Med Chem Lett22:2182-5 (2012) 
 
Carbonic anhydrase 1
Name:Carbonic anhydrase 1
Type:Enzyme
Mol. Mass.:28873.37
Organism:Homo sapiens (Human)
Description:P00915
Residue:261
BDBM50366037
NameBDBM50366037
Synonyms:CHEMBL1955873
TypeSmall organic molecule
Emp. Form.C7H6OS
Mol. Mass.138.187
SMILESOC(=S)c1ccccc1