Reaction Details
TargetCarbonic anhydrase 12
LigandBDBM50366037
Substrate/Competitorn/a
Meas. Tech.ChEMBL_807318 (CHEMBL1960498)
Ki 2770±n/a nM
Citation Carta, FVullo, DMaresca, AScozzafava, ASupuran, CT New chemotypes acting as isozyme-selective carbonic anhydrase inhibitors with low affinity for the offtarget cytosolic isoform II. Bioorg Med Chem Lett22:2182-5 (2012) 
 
Carbonic anhydrase 12
Name:Carbonic anhydrase 12
Type:Enzyme
Mol. Mass.:39456.00
Organism:Homo sapiens (Human)
Description:Catalytic domain of human cloned isozyme was used in the assay
Residue:354
BDBM50366037
NameBDBM50366037
Synonyms:CHEMBL1955873
TypeSmall organic molecule
Emp. Form.C7H6OS
Mol. Mass.138.187
SMILESOC(=S)c1ccccc1