Reaction Details
TargetCarbonic anhydrase 7
LigandBDBM50366038
Substrate/Competitorn/a
Meas. Tech.ChEMBL_807320 (CHEMBL1960500)
Ki 7760±n/a nM
Citation Carta, FVullo, DMaresca, AScozzafava, ASupuran, CT New chemotypes acting as isozyme-selective carbonic anhydrase inhibitors with low affinity for the offtarget cytosolic isoform II. Bioorg Med Chem Lett22:2182-5 (2012) 
 
Carbonic anhydrase 7
Name:Carbonic anhydrase 7
Type:Enzyme
Mol. Mass.:29664.11
Organism:Homo sapiens (Human)
Description:Human cloned isozyme.
Residue:264
BDBM50366038
NameBDBM50366038
Synonyms:CHEMBL1356238
TypeSmall organic molecule
Emp. Form.C5H5NOS
Mol. Mass.127.164
SMILES[O-][n+]1ccccc1S