Reaction Details
TargetCarbonic anhydrase 4
LigandBDBM50366038
Substrate/Competitorn/a
Meas. Tech.ChEMBL_807336 (CHEMBL1960516)
Ki 6130±n/a nM
Citation Carta, FVullo, DMaresca, AScozzafava, ASupuran, CT New chemotypes acting as isozyme-selective carbonic anhydrase inhibitors with low affinity for the offtarget cytosolic isoform II. Bioorg Med Chem Lett22:2182-5 (2012) 
 
Carbonic anhydrase 4
Name:Carbonic anhydrase 4
Type:Enzyme
Mol. Mass.:35037.98
Organism:Homo sapiens (Human)
Description:P22748
Residue:312
BDBM50366038
NameBDBM50366038
Synonyms:CHEMBL1356238
TypeSmall organic molecule
Emp. Form.C5H5NOS
Mol. Mass.127.164
SMILES[O-][n+]1ccccc1S