Reaction Details
TargetCarbonic anhydrase 3
LigandBDBM50366038
Substrate/Competitorn/a
Meas. Tech.ChEMBL_807325 (CHEMBL1960505)
Ki 1620±n/a nM
Citation Carta, FVullo, DMaresca, AScozzafava, ASupuran, CT New chemotypes acting as isozyme-selective carbonic anhydrase inhibitors with low affinity for the offtarget cytosolic isoform II. Bioorg Med Chem Lett22:2182-5 (2012) 
 
Carbonic anhydrase 3
Name:Carbonic anhydrase 3
Type:Enzyme
Mol. Mass.:29562.11
Organism:Homo sapiens (Human)
Description:Human cloned isozyme.
Residue:260
BDBM50366038
NameBDBM50366038
Synonyms:CHEMBL1356238
TypeSmall organic molecule
Emp. Form.C5H5NOS
Mol. Mass.127.164
SMILES[O-][n+]1ccccc1S