Reaction Details
TargetCarbonic anhydrase 1
LigandBDBM50366056
Substrate/Competitorn/a
Meas. Tech.ChEMBL_807742 (CHEMBL1959870)
Ki 7880±n/a nM
Citation Moeker, JTeruya, KRossit, SWilkinson, BLLopez, MBornaghi, LFInnocenti, ASupuran, CTPoulsen, SA Design and synthesis of thiourea compounds that inhibit transmembrane anchored carbonic anhydrases. Bioorg Med Chem20:2392-404 (2012) 
 
Carbonic anhydrase 1
Name:Carbonic anhydrase 1
Type:Enzyme
Mol. Mass.:28873.37
Organism:Homo sapiens (Human)
Description:P00915
Residue:261
BDBM50366056
NameBDBM50366056
Synonyms:CHEMBL1956762
TypeSmall organic molecule
Emp. Form.C14H20N4O8S2
Mol. Mass.436.461
SMILESNS(=O)(=O)c1ccc(cc1)C(=O)NNC(=S)N[C@@H]1O[C@H](CO)[C@@H](O)[C@H](O)[C@H]1O