Reaction Details
TargetCarbonic anhydrase 2
LigandBDBM50366074
Substrate/Competitorn/a
Meas. Tech.ChEMBL_807743 (CHEMBL1959871)
Ki 11.9±n/a nM
Citation Moeker, JTeruya, KRossit, SWilkinson, BLLopez, MBornaghi, LFInnocenti, ASupuran, CTPoulsen, SA Design and synthesis of thiourea compounds that inhibit transmembrane anchored carbonic anhydrases. Bioorg Med Chem20:2392-404 (2012) 
 
Carbonic anhydrase 2
Name:Carbonic anhydrase 2
Type:Enzyme
Mol. Mass.:29250.71
Organism:Homo sapiens (Human)
Description:P00918
Residue:260
BDBM50366074
NameBDBM50366074
Synonyms:CHEMBL1956748
TypeSmall organic molecule
Emp. Form.C22H29N3O11S2
Mol. Mass.575.609
SMILESCC(=O)OC[C@H]1O[C@@H](NC(=S)NCc2ccc(cc2)S(N)(=O)=O)[C@H](OC(C)=O)[C@@H](OC(C)=O)[C@H]1OC(C)=O