Reaction Details
TargetCarbonic anhydrase 2
LigandBDBM50366048
Substrate/Competitorn/a
Meas. Tech.ChEMBL_807743 (CHEMBL1959871)
Ki 10.2±n/a nM
Citation Moeker, JTeruya, KRossit, SWilkinson, BLLopez, MBornaghi, LFInnocenti, ASupuran, CTPoulsen, SA Design and synthesis of thiourea compounds that inhibit transmembrane anchored carbonic anhydrases. Bioorg Med Chem20:2392-404 (2012) 
 
Carbonic anhydrase 2
Name:Carbonic anhydrase 2
Type:Enzyme
Mol. Mass.:29250.71
Organism:Homo sapiens (Human)
Description:P00918
Residue:260
BDBM50366048
NameBDBM50366048
Synonyms:CHEMBL1956754
TypeSmall organic molecule
Emp. Form.C34H44N4O20S2
Mol. Mass.892.858
SMILESCC(=O)OC[C@H]1O[C@@H](NC(=S)NNC(=O)c2ccc(cc2)S(N)(=O)=O)[C@H](OC(C)=O)[C@@H](OC(C)=O)[C@@H]1O[C@H]1O[C@H](COC(C)=O)[C@@H](OC(C)=O)[C@H](OC(C)=O)[C@H]1OC(C)=O