Reaction Details
TargetCarbonic anhydrase 2
LigandBDBM50366067
Substrate/Competitorn/a
Meas. Tech.ChEMBL_807743 (CHEMBL1959871)
Ki 9±n/a nM
Citation Moeker, JTeruya, KRossit, SWilkinson, BLLopez, MBornaghi, LFInnocenti, ASupuran, CTPoulsen, SA Design and synthesis of thiourea compounds that inhibit transmembrane anchored carbonic anhydrases. Bioorg Med Chem20:2392-404 (2012) 
 
Carbonic anhydrase 2
Name:Carbonic anhydrase 2
Type:Enzyme
Mol. Mass.:29250.71
Organism:Homo sapiens (Human)
Description:P00918
Residue:260
BDBM50366067
NameBDBM50366067
Synonyms:CHEMBL1956773
TypeSmall organic molecule
Emp. Form.C21H33N3O12S2
Mol. Mass.583.63
SMILESNS(=O)(=O)c1ccc(CCNC(=S)N[C@@H]2O[C@H](CO)[C@@H](O[C@@H]3O[C@H](CO)[C@H](O)[C@H](O)[C@H]3O)[C@H](O)[C@H]2O)cc1