Reaction Details
TargetCarbonic anhydrase 2
LigandBDBM12136
Substrate/Competitorn/a
Meas. Tech.ChEMBL_807743 (CHEMBL1959871)
Ki 124±n/a nM
Citation Moeker, JTeruya, KRossit, SWilkinson, BLLopez, MBornaghi, LFInnocenti, ASupuran, CTPoulsen, SA Design and synthesis of thiourea compounds that inhibit transmembrane anchored carbonic anhydrases. Bioorg Med Chem20:2392-404 (2012) 
 
Carbonic anhydrase 2
Name:Carbonic anhydrase 2
Type:Enzyme
Mol. Mass.:29250.71
Organism:Homo sapiens (Human)
Description:P00918
Residue:260
BDBM12136
NameBDBM12136
Synonyms:4-(hydrazinecarbonyl)benzene-1-sulfonamide hydrazide 2
TypeSmall organic molecule
Emp. Form.C7H9N3O3S
Mol. Mass.215.23
SMILESNNC(=O)c1ccc(cc1)S(N)(=O)=O