Reaction Details
TargetCarbonic anhydrase 9
LigandBDBM50366047
Substrate/Competitorn/a
Meas. Tech.ChEMBL_807744 (CHEMBL1959872)
Ki 122±n/a nM
Citation Moeker, JTeruya, KRossit, SWilkinson, BLLopez, MBornaghi, LFInnocenti, ASupuran, CTPoulsen, SA Design and synthesis of thiourea compounds that inhibit transmembrane anchored carbonic anhydrases. Bioorg Med Chem20:2392-404 (2012) 
 
Carbonic anhydrase 9
Name:Carbonic anhydrase 9
Type:Enzyme
Mol. Mass.:49669.03
Organism:Homo sapiens (Human)
Description:Catalytic domain of human cloned isozyme was used in the assay
Residue:459
BDBM50366047
NameBDBM50366047
Synonyms:CHEMBL1956753
TypeSmall organic molecule
Emp. Form.C35H47N3O19S2
Mol. Mass.877.886
SMILESCC(=O)OC[C@H]1O[C@@H](NC(=S)NCCc2ccc(cc2)S(N)(=O)=O)[C@H](OC(C)=O)[C@@H](OC(C)=O)[C@@H]1O[C@H]1O[C@H](COC(C)=O)[C@@H](OC(C)=O)[C@H](OC(C)=O)[C@H]1OC(C)=O