Reaction Details
TargetCarbonic anhydrase 12
LigandBDBM50366061
Substrate/Competitorn/a
Meas. Tech.ChEMBL_807745 (CHEMBL1959873)
Ki 300±n/a nM
Citation Moeker, JTeruya, KRossit, SWilkinson, BLLopez, MBornaghi, LFInnocenti, ASupuran, CTPoulsen, SA Design and synthesis of thiourea compounds that inhibit transmembrane anchored carbonic anhydrases. Bioorg Med Chem20:2392-404 (2012) 
 
Carbonic anhydrase 12
Name:Carbonic anhydrase 12
Type:Enzyme
Mol. Mass.:39456.00
Organism:Homo sapiens (Human)
Description:Catalytic domain of human cloned isozyme was used in the assay
Residue:354
BDBM50366061
NameBDBM50366061
Synonyms:CHEMBL1956767
TypeSmall organic molecule
Emp. Form.C19H29N3O12S2
Mol. Mass.555.576
SMILESNS(=O)(=O)c1ccc(NC(=S)N[C@@H]2O[C@H](CO)[C@@H](O[C@H]3O[C@H](CO)[C@@H](O)[C@H](O)[C@H]3O)[C@H](O)[C@H]2O)cc1