Reaction Details
TargetVascular endothelial growth factor receptor 1
LigandBDBM50271907
Substrate/Competitorn/a
Meas. Tech.ChEMBL_807914 (CHEMBL1959297)
IC50 26800±n/a nM
Citation Gangjee, AZaware, NRaghavan, SYang, JThorpe, JEIhnat, MA N¿?¿-(3-Bromophenyl)-7-(substituted benzyl) pyrrolo[2,3-d]pyrimidines as potent multiple receptor tyrosine kinase inhibitors: design, synthesis, and in vivo evaluation. Bioorg Med Chem20:2444-54 (2012) 
 
Vascular endothelial growth factor receptor 1
Name:Vascular endothelial growth factor receptor 1
Type:Receptor Tyrosine Kinase
Mol. Mass.:150800.23
Organism:Homo sapiens (Human)
Description:P17948
Residue:1338
BDBM50271907
NameBDBM50271907
Synonyms:2-(2-chlorobenzyl)-N4-(3-bromophenyl)-1H-indole-4,6-diamine N4-(3-bromophenyl)-6-(2-chlorobenzyl)-7H-pyrrolo[2,3-d]pyrimidine-2,4-diamine
TypeSmall organic molecule
Emp. Form.C19H15BrClN5
Mol. Mass.428.713
SMILESNc1nc(Nc2cccc(Br)c2)c2cc(Cc3ccccc3Cl)[nH]c2n1