Reaction Details
TargetVascular endothelial growth factor receptor 1
LigandBDBM50271908
Substrate/Competitorn/a
Meas. Tech.ChEMBL_807914 (CHEMBL1959297)
IC50 15200±n/a nM
Citation Gangjee, AZaware, NRaghavan, SYang, JThorpe, JEIhnat, MA N¿?¿-(3-Bromophenyl)-7-(substituted benzyl) pyrrolo[2,3-d]pyrimidines as potent multiple receptor tyrosine kinase inhibitors: design, synthesis, and in vivo evaluation. Bioorg Med Chem20:2444-54 (2012) 
 
Vascular endothelial growth factor receptor 1
Name:Vascular endothelial growth factor receptor 1
Type:Receptor Tyrosine Kinase
Mol. Mass.:150800.23
Organism:Homo sapiens (Human)
Description:P17948
Residue:1338
BDBM50271908
NameBDBM50271908
Synonyms:CHEMBL502015 | N4-(3-bromophenyl)-2-(naphthalen-2-ylmethyl)-1H-indole-4,6-diamine
TypeSmall organic molecule
Emp. Form.C23H18BrN5
Mol. Mass.444.327
SMILESNc1nc(Nc2cccc(Br)c2)c2cc(Cc3ccc4ccccc4c3)[nH]c2n1