Reaction Details
TargetVascular endothelial growth factor receptor 2
LigandBDBM50271906
Substrate/Competitorn/a
Meas. Tech.ChEMBL_807913 (CHEMBL1959296)
IC50>50000±n/a nM
Citation Gangjee, AZaware, NRaghavan, SYang, JThorpe, JEIhnat, MA N¿?¿-(3-Bromophenyl)-7-(substituted benzyl) pyrrolo[2,3-d]pyrimidines as potent multiple receptor tyrosine kinase inhibitors: design, synthesis, and in vivo evaluation. Bioorg Med Chem20:2444-54 (2012) 
 
Vascular endothelial growth factor receptor 2
Name:Vascular endothelial growth factor receptor 2
Type:Receptor Tyrosine Kinase
Mol. Mass.:151510.97
Organism:Homo sapiens (Human)
Description:P35968
Residue:1356
BDBM50271906
NameBDBM50271906
Synonyms:2-benzyl-N4-(3-bromophenyl)-1H-indole-4,6-diamine CHEMBL499344
TypeSmall organic molecule
Emp. Form.C19H16BrN5
Mol. Mass.394.268
SMILESNc1nc(Nc2cccc(Br)c2)c2cc(Cc3ccccc3)[nH]c2n1