Reaction Details
TargetEpidermal growth factor receptor
LigandBDBM50366088
Substrate/Competitorn/a
Meas. Tech.ChEMBL_807903 (CHEMBL1959286)
IC50 166400±n/a nM
Citation Gangjee, AZaware, NRaghavan, SYang, JThorpe, JEIhnat, MA N¿?¿-(3-Bromophenyl)-7-(substituted benzyl) pyrrolo[2,3-d]pyrimidines as potent multiple receptor tyrosine kinase inhibitors: design, synthesis, and in vivo evaluation. Bioorg Med Chem20:2444-54 (2012) 
 
Epidermal growth factor receptor
Name:Epidermal growth factor receptor
Type:Receptor Kinase Domain
Mol. Mass.:134279.59
Organism:Homo sapiens (Human)
Description:P00533
Residue:1210
BDBM50366088
NameBDBM50366088
Synonyms:CHEMBL1956888
TypeSmall organic molecule
Emp. Form.C19H16BrN5
Mol. Mass.394.268
SMILESNc1nc(Nc2cccc(Br)c2)c2ccn(Cc3ccccc3)c2n1