Reaction Details
TargetVascular endothelial growth factor receptor 2
LigandBDBM50366089
Substrate/Competitorn/a
Meas. Tech.ChEMBL_807901 (CHEMBL1959284)
IC50 113400±n/a nM
Citation Gangjee, AZaware, NRaghavan, SYang, JThorpe, JEIhnat, MA N¿?¿-(3-Bromophenyl)-7-(substituted benzyl) pyrrolo[2,3-d]pyrimidines as potent multiple receptor tyrosine kinase inhibitors: design, synthesis, and in vivo evaluation. Bioorg Med Chem20:2444-54 (2012) 
 
Vascular endothelial growth factor receptor 2
Name:Vascular endothelial growth factor receptor 2
Type:Receptor Tyrosine Kinase
Mol. Mass.:151510.97
Organism:Homo sapiens (Human)
Description:P35968
Residue:1356
BDBM50366089
NameBDBM50366089
Synonyms:CHEMBL1956889
TypeSmall organic molecule
Emp. Form.C20H18BrN5
Mol. Mass.408.294
SMILESCc1ccccc1Cn1ccc2c(Nc3cccc(Br)c3)nc(N)nc12